{"text_format":"1","workbook":"xlsx","n_sheets":10,"sheets":["Instructions","Costs","Sources","Credit Info","Bldg Info","Unit Mix","Op Budg","Cash Flow","Owner Cert","Auditor Cert"],"not_rendered":{"charts":0,"images":0,"macros":1,"external_links":0,"defined_names":22,"comments":2,"pivot_tables":0},"unopened":[],"bounds":{"document_bytes":16777216,"sheet_cells":100000,"rows_first":2000,"rows_last":500,"rows_between":2000,"halvings":0,"cell_chars":16384,"cell_head_chars":4096},"cells_cut":0,"cells_raw":0,"read":"whole","date_system":"1900"}

{"sheet":"Instructions","index":0,"n_rows":51,"n_cols":8,"rows_kept":51,"cut":false,"hidden":false,"merged":[[47,5,47,7],[1,1,1,10],[41,6,41,7],[3,1,8,10],[10,1,16,10],[45,7,45,8],[43,5,43,6],[45,5,45,6],[22,1,23,11]]}
[]
[null,"Final Cost Certification Instructions"]
[]
[null,"To complete the Final Cost Certification, use your 'Tab' key to move through each field of each page.  The entire form and each page should be completed in order, from left to right.  Because some data flows through multiple pages, failure to complete the form in order could cause some fields to not fill or calculate.  'Shift-Tab' will move you back to previous cells.  To move between sections, click on the desired tab below.  Please refer to the Qualified Allocation Plan (\"QAP\") for the year in which your project was awarded credits to ensure your project meets all of that year's QAP requirements."]
[]
[]
[]
[]
[]
[]
[null,"When you have completed the Final Cost Certification, save and email a copy to the Development Analyst who is assigned to your project.  You will also need to mail all of the items listed below.  Once all of those items are received, NCHFA will have a minimum of 30 days to issue 8609s.  Depending on the time of year, the minimum time may be longer.  Prior to issuing 8609s, the Development Analyst will email the Final Cost Certification with any changes to the developer.  The developer will need to print the entire document, complete and sign the Certification page, and mail it back to NCHFA along with the Independent Auditors' Report (Auditor Cert tab) on auditors' letterhead."]
[]
[]
[]
[]
[]
[]
[]
[null,"Should you have any problems or questions completing this form, please contact Chris Austin"]
[null,"at (919) 877-5662 or by email at",null,null,null,"claustin@nchfa.com"]
{"$rows_left_out":32}
{"sheet":"Costs","index":1,"n_rows":85,"n_cols":11,"rows_kept":85,"cut":false,"hidden":false,"merged":[[8,4,8,5],[1,1,1,5],[84,1,84,2]]}
[]
[null,"Project Development Costs"]
[]
[]
[null,"Project Name:",null,"Year Awarded:",null,"Project #:"]
[]
[]
[null,null,null,null,null,null,null,2011]
[null,"Cost","Total",null,"Eligible Basis",null,null,2012]
[null,"Element","Cost",null,"30% PV","70% PV",null,2013]
[null,"1.    Purchase of Building(s) (Rehab / Adaptive Reuse only)",null,null,null,null,null,2014]
[null,"2.    Demolition (Rehab / Adaptive Reuse only)"]
[null,"3.    On-site Improvements"]
[null,"4.    Rehabilitation"]
[null,"5.    Construction of New Building(s)"]
[null,"6.    Accessory Building(s)"]
[null,"7.    General Requirements (max 6% lines 2-6)",null,{"$f":"IF(ISBLANK(C17),0,C17/SUM(C12:C16))","v":0}]
[null,"8.    Contractor Overhead (max 2% lines 2-7)",null,{"$f":"IF(ISBLANK(C18),0,C18/SUM(C12:C17))","v":0}]
[null,"9.    Contractor Profit (max 8% lines 2-7; 6% if Identity of Interest)",null,{"$f":"IF(ISBLANK(C19),0,C19/SUM(C12:C17))","v":0}]
[null,"10.  Construction Contingency (max 5% lines 2-9, Rehabs 10%)",null,{"$f":"IF(ISBLANK(C20),0,C20/SUM(C12:C19))","v":0}]
{"$rows_left_out":66}
{"sheet":"Sources","index":2,"n_rows":37,"n_cols":8,"rows_kept":37,"cut":false,"hidden":false,"merged":[[1,1,1,7],[30,1,30,2],[30,4,34,7],[37,1,43,7]]}
[]
[null,"Project Funding Sources"]
[]
[null,"Project Name:"]
[null,{"$f":"IF(Costs!B6=\"\",\"\",Costs!B6)","v":""},null,null,null,"Project #:",{"$f":"IF(Costs!F6=\"\",\"\",Costs!F6)","v":""}]
[]
[]
[null,"Source","Amount","% of   Total","Rate","Term","Amort     Period","Annual D.S."]
[null,"Bank Loan",null,{"$f":"IF($C$27=0,0,C9/$C$27)","v":0}]
[null,"RPP Loan",null,0]
[null,"Local Government Loan",null,0]
[null,"RD 515 Loan",null,0]
[null,"AHP Loan",null,0]
[null,"Other Loan",null,0]
[null,"Non-Amortizing Loan*",null,0]
[null,"Non-Amortizing Loan*",null,0]
[null,"Non-Amortizing Loan*",null,0]
[null,"Tax Exempt Bond*",null,0]
[null,"State Tax Credit (Loan)",null,0,0,30,30]
[null,"State Tax Credit (Direct Refund)",null,0]
{"$rows_left_out":18}
{"sheet":"Credit Info","index":3,"n_rows":57,"n_cols":13,"rows_kept":57,"cut":false,"hidden":false,"merged":[[1,1,1,12],[8,3,8,4],[8,5,8,6],[8,11,8,12],[8,8,8,9],[4,9,4,10],[55,11,55,12],[52,1,52,2],[54,10,54,12],[53,11,53,12],[54,5,54,6],[54,8,54,9],[55,5,55,6],[55,8,55,9],[53,8,53,9],[53,5,53,6]]}
[]
[null,"Building by Building Credit Allocation"]
[]
[]
[null,"Project Name:",{"$f":"IF(Costs!B6=\"\",\"\",Costs!B6)","v":""},null,null,null,null,null,null,"Project #:",null,{"$f":"IF(Costs!F6=\"\",\"\",Costs!F6)","v":""}]
[]
[null,null,null,"No","Was this project in a QCT or DDA when credits were awarded?",null,null,null,null,null,null,null,"No"]
[null,null,null,null,null,null,null,null,null,null,null,null,"Yes"]
[null,null,"Address of Building","Placed in Service Date",null,"Eligible Basis",null,"QCT / DDA","Qualified Basis",null,"Credit","Credit Amount"]
[null,"BIN","(must be actual street address)","New / Rehab","Acquisition","New / Rehab","Acquisition","Boost","New / Rehab","Acquisition","Rate","New / Rehab","Acquistion"]
[null,null,null,null,null,null,null,{"$f":"IF(B11=\"\",\"\",IF($D$7=\"\",\"\",IF(E11>0,\"100%\",IF(G11>0,\"100%\",IF($D$7=\"\",\"\",IF($D$7=\"No\",\"100%\",\"130%\"))))))","v":""},{"$f":"IF(H11=\"\",\"\",IF(F11=\"\",\"\",IF(H11=100,F11*H11,ROUND(F11*H11,0))))","v":""},{"$f":"IF(H11=\"\",\"\",IF(G11>0,G11*H11,\"\"))","v":""},null,{"$f":"IF(E11>0,\"\",IF(G11>0,\"\",IF(H11=\"\",\"\",IF(F11=0,\"\",IF(D11=\"\",\"\",ROUND(I11*K11,0))))))","v":""},{"$f":"IF(D11>0,\"\",IF(F11>0,\"\",IF(G11=0,\"\",IF(J11=\"\",\"\",IF(E11=\"\",\"\",ROUND(J11*K11,0))))))","v":""}]
[null,null,null,null,null,null,null,"",{"$f":"IF(H12=\"\",\"\",IF(F12=\"\",\"\",IF(H12=100,F12*H12,ROUND(F12*H12,0))))","v":""},{"$f":"IF(H12=\"\",\"\",IF(G12>0,G12*H12,\"\"))","v":""},null,{"$f":"IF(E12>0,\"\",IF(G12>0,\"\",IF(H12=\"\",\"\",IF(F12=0,\"\",IF(D12=\"\",\"\",ROUND(I12*K12,0))))))","v":""},{"$f":"IF(D12>0,\"\",IF(F12>0,\"\",IF(G12=0,\"\",IF(J12=\"\",\"\",IF(E12=\"\",\"\",ROUND(J12*K12,0))))))","v":""}]
[null,null,null,null,null,null,null,"","","",null,"",""]
[null,null,null,null,null,null,null,"","","",null,"",""]
[null,null,null,null,null,null,null,"","","",null,"",""]
[null,null,null,null,null,null,null,"","","",null,"",""]
[null,null,null,null,null,null,null,"","","",null,"",""]
[null,null,null,null,null,null,null,"","","",null,"",""]
[null,null,null,null,null,null,null,"","","",null,"",""]
[null,null,null,null,null,null,null,"","","",null,"",""]
{"$rows_left_out":38}
{"sheet":"Bldg Info","index":4,"n_rows":53,"n_cols":10,"rows_kept":53,"cut":false,"hidden":false,"merged":[[51,1,51,7],[1,1,1,9],[4,5,4,6],[4,7,4,9],[7,3,7,8]]}
[]
[null,"Building Unit Info"]
[]
[]
[null,"Project Name:",{"$f":"IF('Credit Info'!C5=0,\"\",'Credit Info'!C5)","v":""},null,null,"Project #:",null,{"$f":"IF('Credit Info'!L5=0,\"\",'Credit Info'!L5)","v":""}]
[]
[]
[null,null,null,"Unit Info"]
[null,"BIN","Address of Building","Eff","1BR","2BR","3BR","4BR","5BR","Total"]
[null,{"$f":"IF('Credit Info'!B11=\"\",\"\",IF('Credit Info'!G11>0,\"\",'Credit Info'!B11))","v":""},{"$f":"IF('Credit Info'!C11=\"\",\"\",IF('Credit Info'!G11>0,\"\",'Credit Info'!C11))","v":""},null,null,null,null,null,null,{"$f":"IF(B10=\"\",\"\",(SUM(D10:I10)))","v":""}]
[null,{"$f":"IF('Credit Info'!B12=\"\",\"\",IF('Credit Info'!G12>0,\"\",'Credit Info'!B12))","v":""},{"$f":"IF('Credit Info'!C12=\"\",\"\",IF('Credit Info'!G12>0,\"\",'Credit Info'!C12))","v":""},null,null,null,null,null,null,{"$f":"IF(B11=\"\",\"\",(SUM(D11:I11)))","v":""}]
[null,{"$f":"IF('Credit Info'!B13=\"\",\"\",IF('Credit Info'!G13>0,\"\",'Credit Info'!B13))","v":""},{"$f":"IF('Credit Info'!C13=\"\",\"\",IF('Credit Info'!G13>0,\"\",'Credit Info'!C13))","v":""},null,null,null,null,null,null,""]
[null,{"$f":"IF('Credit Info'!B14=\"\",\"\",IF('Credit Info'!G14>0,\"\",'Credit Info'!B14))","v":""},{"$f":"IF('Credit Info'!C14=\"\",\"\",IF('Credit Info'!G14>0,\"\",'Credit Info'!C14))","v":""},null,null,null,null,null,null,""]
[null,{"$f":"IF('Credit Info'!B15=\"\",\"\",IF('Credit Info'!G15>0,\"\",'Credit Info'!B15))","v":""},{"$f":"IF('Credit Info'!C15=\"\",\"\",IF('Credit Info'!G15>0,\"\",'Credit Info'!C15))","v":""},null,null,null,null,null,null,""]
[null,{"$f":"IF('Credit Info'!B16=\"\",\"\",IF('Credit Info'!G16>0,\"\",'Credit Info'!B16))","v":""},{"$f":"IF('Credit Info'!C16=\"\",\"\",IF('Credit Info'!G16>0,\"\",'Credit Info'!C16))","v":""},null,null,null,null,null,null,""]
[null,{"$f":"IF('Credit Info'!B17=\"\",\"\",IF('Credit Info'!G17>0,\"\",'Credit Info'!B17))","v":""},{"$f":"IF('Credit Info'!C17=\"\",\"\",IF('Credit Info'!G17>0,\"\",'Credit Info'!C17))","v":""},null,null,null,null,null,null,""]
[null,{"$f":"IF('Credit Info'!B18=\"\",\"\",IF('Credit Info'!G18>0,\"\",'Credit Info'!B18))","v":""},{"$f":"IF('Credit Info'!C18=\"\",\"\",IF('Credit Info'!G18>0,\"\",'Credit Info'!C18))","v":""},null,null,null,null,null,null,""]
[null,{"$f":"IF('Credit Info'!B19=\"\",\"\",IF('Credit Info'!G19>0,\"\",'Credit Info'!B19))","v":""},{"$f":"IF('Credit Info'!C19=\"\",\"\",IF('Credit Info'!G19>0,\"\",'Credit Info'!C19))","v":""},null,null,null,null,null,null,""]
[null,{"$f":"IF('Credit Info'!B20=\"\",\"\",IF('Credit Info'!G20>0,\"\",'Credit Info'!B20))","v":""},{"$f":"IF('Credit Info'!C20=\"\",\"\",IF('Credit Info'!G20>0,\"\",'Credit Info'!C20))","v":""},null,null,null,null,null,null,""]
[null,{"$f":"IF('Credit Info'!B21=\"\",\"\",IF('Credit Info'!G21>0,\"\",'Credit Info'!B21))","v":""},{"$f":"IF('Credit Info'!C21=\"\",\"\",IF('Credit Info'!G21>0,\"\",'Credit Info'!C21))","v":""},null,null,null,null,null,null,""]
{"$rows_left_out":34}
{"sheet":"Unit Mix","index":5,"n_rows":105,"n_cols":20,"rows_kept":105,"cut":false,"hidden":false,"merged":[[48,4,54,13],[43,9,43,10],[7,2,7,5],[1,1,1,13],[10,12,10,13],[4,1,4,2],[4,3,4,6]]}
[]
[null,"Unit Mix"]
[]
[null,null,null,null,null,null,null,null,null,null,null,null,null,null,null,null,null,null,"County","Median Income"]
[null,"Project Name:",null,{"$f":"IF('Credit Info'!C5=0,\"\",'Credit Info'!C5)","v":""},null,null,null,null,null,null,null,"Project #:",{"$f":"IF('Credit Info'!L5=0,\"\",'Credit Info'!L5)","v":""}]
[null,null,null,null,null,null,null,null,null,null,null,null,null,null,null,null,null,null,"Alamance",56100]
[null,null,null,null,null,null,null,null,null,null,null,null,null,null,null,null,null,null,"Alexander",51100]
[null,"County:",null,null,null,null,null,null,null,null,"Median Income:",{"$f":"IF(C8=\"\",\"\",VLOOKUP(C8,S5:T105,2))","v":""},null,null,null,null,null,null,"Alleghany",41000]
[null,null,null,null,null,null,null,null,null,null,null,null,null,null,null,null,null,null,"Anson",42100]
[null,null,null,null,null,null,null,null,null,null,null,null,null,null,null,null,null,null,"Ashe",49500]
[null,null,null,null,"HOME",null,"Accessible","Net","Monthly","Utility","Total Housing","% of","Yearly Income",null,{"$f":"'Bldg Info'!J52","v":0},null,null,null,"Avery",50600]
[null,"# BRs","Type*","# Baths","Trend?","# of Units","Units","Sq Feet","Rent","Allowance","Cost","Median","Non-HOME","HOME",null,null,null,null,"Beaufort",52800]
[null,null,null,null,null,null,null,null,null,null,{"$f":"IF(B13=0,\"\",I13+J13)","v":""},{"$f":"IF($L$8=\"\",\"\",IF(B13=\"\",\"\",IF(B13=\"Eff\",K13*12/0.3/($L$8*0.7),IF(B13=1,K13*12/0.3/($L$8*0.75),IF(B13=2,K13*12/0.3/($L$8*0.9),IF(B13=3,K13*12/0.3/($L$8*1.04),K13*12/0.3/($L$8*1.16)))))))","v":""},{"$f":"IF(B13=\"\",\"\",IF(F13=\"\",\"\",IF(E13=\"No\",F13*I13*12,\"\")))","v":""},{"$f":"IF(B13=\"\",\"\",IF(F13=\"\",\"\",IF(E13=\"Yes\",F13*I13*12,\"\")))","v":""},null,null,null,null,"Bertie",41900]
[null,null,null,null,null,null,null,null,null,null,"","","","",null,null,null,null,"Bladen",44600]
[null,null,null,null,null,null,null,null,null,null,"","","","",null,null,null,null,"Brunswick",62700]
[null,null,null,null,null,null,null,null,null,null,"","","","",null,null,null,null,"Buncombe",58400]
[null,null,null,null,null,null,null,null,null,null,"","","","",null,null,null,null,"Burke",51100]
[null,null,null,null,null,null,null,null,null,null,"","","","",null,null,null,null,"Cabarrus",64100]
[null,null,null,null,null,null,null,null,null,null,"","","","",null,null,null,null,"Caldwell",51100]
[null,null,null,null,null,null,null,null,null,null,"","","","",null,null,null,null,"Camden",79000]
{"$rows_left_out":86}
{"sheet":"Op Budg","index":6,"n_rows":76,"n_cols":6,"rows_kept":76,"cut":false,"hidden":false,"merged":[[9,2,9,4],[14,2,14,4],[10,2,10,4],[11,2,11,4],[12,2,12,4],[13,2,13,4],[19,2,19,4],[20,2,20,4],[21,1,26,1],[21,2,21,4],[22,2,22,4],[23,2,23,4],[24,2,24,4],[25,2,25,4],[26,2,26,4],[7,1,20,1],[15,2,15,4],[16,2,16,4],[17,2,17,4],[18,2,18,4],[7,2,7,4],[8,2,8,4],[27,1,48,1],[27,2,27,4],[28,2,28,4],[29,2,29,4],[30,2,30,4],[31,2,31,4],[32,2,32,4],[33,2,33,4],[34,2,34,4],[35,2,35,4],[40,2,40,4],[41,2,41,4],[42,2,42,4],[43,2,43,4],[36,2,36,4],[37,2,37,4],[44,2,44,4],[45,2,45,4],[46,2,46,4],[47,2,47,4],[38,2,38,4],[39,2,39,4],[60,2,60,4],[61,2,61,4],[62,2,62,4],[48,2,48,4],[56,2,56,4],[53,2,53,4],[54,2,54,4],[55,2,55,4],[76,2,76,4],[63,2,63,4],[64,1,66,1],[64,2,64,4],[65,2,65,4],[66,2,66,4],[71,2,71,4],[72,2,72,4],[73,2,73,4],[74,2,74,4],[69,2,69,4],[1,1,1,5],[3,1,3,2],[4,1,4,3],[68,1,75,1],[68,2,68,4],[70,2,70,4],[75,2,75,4],[57,2,57,4],[58,1,62,1],[58,2,58,4],[49,1,57,1],[49,2,49,4],[50,2,50,4],[51,2,51,4],[52,2,52,4],[59,2,59,4]]}
[]
[null,"Project Operations"]
[]
[null,"Project Name:",null,null,null,"Project #:"]
[null,{"$f":"IF(Costs!B6=\"\",\"\",Costs!B6)","v":""},null,null,null,{"$f":"IF(Costs!F6=\"\",\"\",Costs!F6)","v":""}]
[]
[]
[null,"Admin Expenses","Advertising"]
[null,null,"Office Salaries"]
[null,null,"Office Supplies"]
[null,null,"Office or Model Apartment Rent"]
[null,null,"Management Fee"]
[null,null,"Manager or Superintendent Salaries"]
[null,null,"Manager or Superintendent Rent Free Unit"]
[null,null,"Legal Expenses (Project)"]
[null,null,"Auditing Expenses (Project)"]
[null,null,"Bookkeeping Fees / Accounting Services"]
[null,null,"Telephone and Answering Service"]
[null,null,"Bad Debts"]
[null,null,"Other Administrative Expenses (specify)"]
{"$rows_left_out":57}
{"sheet":"Cash Flow","index":7,"n_rows":96,"n_cols":33,"rows_kept":96,"cut":false,"hidden":false,"merged":[[95,1,95,2],[44,4,44,5],[44,6,44,7],[2,1,2,2],[45,4,45,5],[45,6,45,7],[46,4,46,5],[32,1,32,2]]}
[]
[null,"Project Name:",null,null,null,"Project #:"]
[null,{"$f":"IF(Costs!B6=\"\",\"\",Costs!B6)","v":""},null,null,null,{"$f":"IF(Costs!F6=\"\",\"\",Costs!F6)","v":""}]
[]
[]
[null,"Income Trend",0.02,"YR 1","YR 2","YR 3","YR 4","YR 5","YR 6","YR 7","YR 8","YR 9","YR 10","YR 11","YR 12","YR 13","YR 14","YR 15","YR 16","YR 17","YR 18","YR 19","YR 20","YR 21","YR 22","YR 23","YR 24","YR 25","YR 26","YR 27","YR 28","YR 29","YR 30"]
[null,"Expenses Trend",0.03]
[null,"   Gross Rent",null,{"$f":"'Unit Mix'!M35","v":0},{"$f":"D8*(1+$C$6)","v":0},{"$f":"E8*(1+$C$6)","v":0},{"$f":"F8*(1+$C$6)","v":0},{"$f":"G8*(1+$C$6)","v":0},0,0,0,0,0,0,0,0,0,0,0,0,0,0,0,0,0,0,0,0,0,0,0,0,0]
[null,"+ HOME Rent (trends at 1.5%)",null,{"$f":"'Unit Mix'!N35","v":0},{"$f":"D9*1.015","v":0},{"$f":"E9*1.015","v":0},{"$f":"F9*1.015","v":0},0,0,0,0,0,0,0,0,0,0,0,0,0,0,0,0,0,0,0,0,0,0,0,0,0,0]
[null,"+ Stores/Commercial, Laundry/Vending",null,{"$f":"'Op Budg'!F70+'Op Budg'!F71","v":0},{"$f":"D10*(1+$C$6)","v":0},{"$f":"E10*(1+$C$6)","v":0},0,0,0,0,0,0,0,0,0,0,0,0,0,0,0,0,0,0,0,0,0,0,0,0,0,0,0]
[null,"+ Other Income",null,{"$f":"'Op Budg'!F72","v":0},{"$f":"D11*(1+$C$6)","v":0},0,0,0,0,0,0,0,0,0,0,0,0,0,0,0,0,0,0,0,0,0,0,0,0,0,0,0,0]
[null,"= Gross Income",null,{"$f":"SUM(D8:D11)","v":0},{"$f":"SUM(E8:E11)","v":0},0,0,0,0,0,0,0,0,0,0,0,0,0,0,0,0,0,0,0,0,0,0,0,0,0,0,0,0]
[null,"-  7% Vacancy Allowance",null,{"$f":"D12*0.07","v":0},{"$f":"E12*0.07","v":0},0,0,0,0,0,0,0,0,0,0,0,0,0,0,0,0,0,0,0,0,0,0,0,0,0,0,0,0]
[null,"= Net Rental Income",null,{"$f":"D12-D13","v":0},{"$f":"E12-E13","v":0},0,0,0,0,0,0,0,0,0,0,0,0,0,0,0,0,0,0,0,0,0,0,0,0,0,0,0,0]
[null,"- Operating Expenses",null,{"$f":"'Op Budg'!F65-'Op Budg'!ReplcmntReserves","v":0},{"$f":"D15*(1+$C$7)","v":0},{"$f":"E15*(1+$C$7)","v":0},0,0,0,0,0,0,0,0,0,0,0,0,0,0,0,0,0,0,0,0,0,0,0,0,0,0,0]
[null,"- Replacement Reserves",null,{"$f":"'Op Budg'!ReplcmntReserves","v":0},{"$f":"D16*(1.04)","v":0},{"$f":"E16*(1.04)","v":0},{"$f":"F16*(1.04)","v":0},0,0,0,0,0,0,0,0,0,0,0,0,0,0,0,0,0,0,0,0,0,0,0,0,0,0]
[null,"= Net Operating Income",null,{"$f":"D14-SUM(D15:D16)","v":0},0,0,0,0,0,0,0,0,0,0,0,0,0,0,0,0,0,0,0,0,0,0,0,0,0,0,0,0,0]
[null,"- Bank Loan",null,{"$f":"D39","v":0},{"$f":"E39","v":0},0,0,0,0,0,0,0,0,0,0,0,0,0,0,0,0,0,0,0,0,0,0,0,0,0,0,0,0]
[null,"- RPP Loan",null,{"$f":"D51","v":0},0,0,0,0,0,0,0,0,0,0,0,0,0,0,0,0,0,0,0,0,0,0,0,0,0,0,0,0,0]
[null,"- Local Government Loan",null,{"$f":"D57","v":0},{"$f":"E57","v":0},0,0,0,0,0,0,0,0,0,0,0,0,0,0,0,0,0,0,0,0,0,0,0,0,0,0,0,0]
{"$rows_left_out":77}
{"sheet":"Owner Cert","index":8,"n_rows":59,"n_cols":16,"rows_kept":59,"cut":false,"hidden":false,"merged":[[1,1,1,11],[3,3,3,6],[5,5,5,8],[7,3,7,5],[56,10,56,11],[52,8,52,11],[53,5,53,7],[54,3,54,4],[54,5,54,7],[54,9,54,11],[52,3,52,4],[52,5,52,7],[48,2,48,6],[49,5,49,6],[9,3,9,5],[44,1,44,6],[57,1,57,2],[45,2,45,4],[46,2,46,4],[58,3,58,4],[58,5,58,6],[56,1,56,2],[56,3,56,4],[56,5,56,7]]}
[]
[null,"Owner Certification"]
[]
[null,"Project Name:",null,{"$f":"IF(Costs!B6=\"\",\"\",Costs!B6)","v":""},null,null,null,"(\"Project\")",null,"Project #:",{"$f":"IF(Costs!F6=\"\",\"\",Costs!F6)","v":""}]
[]
[null,"Name of Ownership Entity:",null,null,null,null,null,null,null,"(\"Owner\")"]
[]
[null,"Tax ID Number:"]
[]
[null,"The undersigned ",null,null,null,null,"of the Owner, in connection with the award and allocation by the North Carolina",null,null,null,null,null,null,null,null,"general partner"]
[null,"Federal Tax Reform Allocation Committee (“NCTRAC”) of low-income housing credits (“Allocation”) hereby certifies ",null,null,null,null,null,null,null,null,null,null,null,null,null,"managing member"]
[null,"on behalf of the Owner as follows:"]
[]
[null,"(a) The Owner (i) is validly existing and qualified to transact business under the laws of North Carolina, (ii) has the full "]
[null,"power and authority to own its properties and assets and to carry on its business as now being conducted, and (iii) has",null,null,null,null,null,null,null,null,null,null,null,null,null,"partnership"]
[null,"the full legal right, power and authority to execute and deliver this document.",null,null,null,null,null,null,null,null,null,null,null,null,null,"liability company"]
[]
[null,"(b) There is no action, suit or proceeding at law or in equity or by or before any governmental instrumentality or other"]
[null,"agency now pending, or, to the knowledge of the Owner, threatened against or affecting it or any of its properties or"]
[null,"rights, which, if adversely determined, would materially impair its right to carry on business substantially as now conducted"]
{"$rows_left_out":40}
{"sheet":"Auditor Cert","index":9,"n_rows":52,"n_cols":12,"rows_kept":52,"cut":false,"hidden":false,"merged":[[3,9,3,10],[50,1,50,3],[1,1,1,12],[3,3,3,6],[5,4,5,8],[8,1,8,3],[39,7,39,10]]}
[]
[null,"Independent Auditors' Report"]
[]
[null,"Project Name:",null,{"$f":"IF(Costs!B6=\"\",\"\",Costs!B6)","v":""},null,null,null,"(\"Project\")",null,"Project #:",null,{"$f":"IF(Costs!F6=\"\",\"\",Costs!F6)","v":""}]
[]
[null,"Name of Ownership Entity:",null,null,{"$f":"IF('Owner Cert'!F6=\"\",\"\",'Owner Cert'!F6)","v":""},null,null,null,null,"(\"Owner\")"]
[]
[null,"We have audited the costs included in the accompanying Final Cost Certification of the Owner for the Project as of"]
[null,null,null,null,"(date).  Our responsibility is to express an opinion on the following pages"]
[null,"contained in the Final Cost Certification based on our audit: Costs, Sources and Credit Info (\"financial statements\").  "]
[null,"The remaining information, statements and representations contained in this report are the responsibility of the Owner"]
[null,"and the Owner's management which has not been subjected to the auditing procedures applied in the audit of the "]
[null,"financial statements and we make no claim to its authenticity nor do we express an opinion on its accuracy."]
[]
[null,"Auditor's Responsibility"]
[null,"We conducted our audit in accordance with auditing standards generally accepted in the United States of America.  "]
[null,"Those standards require we plan and perform the audit to obtain reasonable assurance about whether the financial "]
[null,"statements are free of material misstatement."]
[]
[null,"An audit involves performing procedures to obtain audit evidence about the amounts and disclosures in the financial"]
{"$rows_left_out":32}